{"text_format":"1","workbook":"xlsx","n_sheets":11,"sheets":["Hoofdmenu","Toelichting","NAW_gegevens","Voorblad","Kostenverzamelstaat","Specifieke informatie A","Specifieke informatie C","Contractinformatie","Controleoverzicht","Blad1","Parameters"],"not_rendered":{"charts":0,"images":1,"macros":1,"external_links":0,"defined_names":442,"comments":1,"pivot_tables":0},"unopened":[],"bounds":{"document_bytes":16777216,"sheet_cells":100000,"rows_first":2000,"rows_last":500,"rows_between":2000,"halvings":0,"cell_chars":16384,"cell_head_chars":4096},"cells_cut":0,"cells_raw":0,"read":"whole","date_system":"1900"}

{"sheet":"Hoofdmenu","index":0,"n_rows":3,"n_cols":2,"rows_kept":3,"cut":false,"hidden":false,"merged":[[0,0,0,1],[1,0,1,1]]}
["HOOFDMENU"]
[{"$f":"CONCATENATE(\"JAARSTAAT ZVW \",jaar_id)","v":"JAARSTAAT ZVW 2024"}]
["Navigatie","Afdrukken"]

{"sheet":"Toelichting","index":1,"n_rows":3,"n_cols":2,"rows_kept":3,"cut":false,"hidden":false,"merged":[]}
[]
[]
[null,{"$f":"CONCATENATE(\" JAARSTAAT ZVW \",jaar_id,\" (VERSIE: \",document_id,\")\")","v":" JAARSTAAT ZVW 2024 (VERSIE: JS2024ZVW.C)"}]

{"sheet":"NAW_gegevens","index":2,"n_rows":36,"n_cols":5,"rows_kept":36,"cut":false,"hidden":false,"merged":[[2,0,2,1],[3,0,3,1]]}
[]
[]
["NAW-GEGEVENS"]
[{"$f":"CONCATENATE(\"JAARSTAAT ZVW 2024\")","v":"JAARSTAAT ZVW 2024"}]
[" Selecteer uw nummer:>","0000 KIES UW UZOVI-NUMMER"]
[" Uzovi-nummer:",{"$f":"MID(keuze_uzovi_nummer,1,4)","v":"0000"}]
[" Verzekeraar:",{"$f":"MID(keuze_uzovi_nummer,6,40)","v":"KIES UW UZOVI-NUMMER"}]
[" Plaats:",{"$f":"VLOOKUP(naw_uzovi_zorgverzekeraar,A17:E36,5,FALSE)","v":{"$error":"#N/A"}}]
[" Contactpersoon:"]
[" Telefoonnummer:"]
[" E-mail:"]
[]
[]
["Let op dat u het goede UZOVI-nummer invult, zie onderstaand overzicht:"]
[]
{"$rows_left_out":22}
{"sheet":"Voorblad","index":3,"n_rows":33,"n_cols":4,"rows_kept":33,"cut":false,"hidden":false,"merged":[[13,3,14,11],[15,3,16,11],[19,3,20,11],[21,3,22,11]]}
[null,null,"VOORBLAD"]
[]
[]
[]
[]
["Pagina 1"]
[]
[]
[]
[]
[]
[]
[]
[]
[]
{"$rows_left_out":19}
{"sheet":"Kostenverzamelstaat","index":4,"n_rows":147,"n_cols":17,"rows_kept":147,"cut":false,"hidden":false,"merged":[[139,12,140,12],[129,3,130,11],[10,12,11,12],[12,12,13,12],[129,13,130,13],[129,12,130,12],[10,13,11,13],[12,13,13,13],[94,12,95,12],[96,12,97,12],[87,3,87,4],[69,3,69,6],[70,3,70,6],[61,3,61,6],[73,3,73,6],[75,3,75,6],[79,3,79,6],[71,3,71,6],[72,3,72,6],[142,3,142,6],[146,3,146,4],[139,9,140,9],[139,10,140,10],[139,11,140,11],[139,3,140,6],[139,7,140,7],[139,8,140,8],[139,13,140,13],[141,3,141,6],[94,3,97,6],[94,8,95,9],[94,10,95,11],[94,13,95,13],[96,7,97,7],[96,8,97,8],[96,9,97,9],[96,10,97,10],[96,11,97,11],[96,13,97,13],[100,3,100,6],[101,3,101,6],[104,3,104,7],[99,3,99,6],[42,9,42,13],[49,10,50,11],[49,13,50,13],[51,7,52,7],[51,8,52,8],[51,9,52,9],[51,10,52,10],[51,11,52,11],[51,13,52,13],[49,12,50,12],[51,12,52,12],[19,3,19,6],[42,3,42,4],[41,3,41,4],[20,3,20,6],[21,3,21,6],[22,3,22,6],[10,3,13,6],[10,8,11,9],[10,10,11,11],[12,7,13,7],[12,8,13,8],[12,9,13,9],[12,10,13,10],[12,11,13,11],[49,3,52,6],[57,3,57,6],[134,3,135,11],[134,12,135,12],[134,13,135,13],[59,3,59,6],[60,3,60,6],[49,8,50,9],[80,3,80,6],[81,3,81,6],[82,3,82,6],[87,9,87,13],[62,3,62,6],[63,3,63,6],[67,3,67,6],[68,3,68,6]]}
[null,null,"INVULSPECIFICATIES SPECIFIEKE INFORMATIE A"]
[]
[]
[]
[]
["Pagina 1",null,null,{"$f":"CONCATENATE(\"JAARSTAAT ZVW \", jaar_id)","v":"JAARSTAAT ZVW 2024"}]
[null,null,null,"SPECIFIEKE INFORMATIE A: KOSTENVERZAMELSTAAT"]
[null,null,null,{"$f":"IF(naw_uzovi_zorgverzekeraar<>\"0000\",CONCATENATE(UPPER(naw_naam_zorgverzekeraar),\", \",UPPER(naw_plaats_zorgverzekeraar)),\"\")","v":""},null,null,null,null,null,null,null,null,null,{"$f":"CONCATENATE(\"UZOVI: \",naw_uzovi_zorgverzekeraar)","v":"UZOVI: 0000"}]
[null,null,null,"SPECIFICATIES INFORMATIE RISICOVEREVENING"]
[null,null,null,{"$f":"$D$7","v":"SPECIFIEKE INFORMATIE A: KOSTENVERZAMELSTAAT"}]
[null,null,null," KOSTENRUBRIEK",null,null,null,null,{"$f":"CONCATENATE(\"LASTEN \",jaar_id)","v":"LASTEN 2024"},null,{"$f":"CONCATENATE(\"LASTEN \",jaar_id-1)","v":"LASTEN 2023"},null,{"$f":"CONCATENATE(\"LASTEN \",jaar_id-2)","v":"LASTEN 2022"},"LASTEN uit eerdere jaren"]
[]
[null,null,null,null,null,null,null,"Code",{"$f":"CONCATENATE(\"LASTEN \",jaar_id,\" inclusief balanspost \")","v":"LASTEN 2024 inclusief balanspost "},{"$f":"CONCATENATE(\"Ontvangen en geaccepteerde declaraties m.b.t. \",jaar_id)","v":"Ontvangen en geaccepteerde declaraties m.b.t. 2024"},{"$f":"CONCATENATE(\"LASTEN \",jaar_id-1,\" inclusief balanspost \")","v":"LASTEN 2023 inclusief balanspost "},{"$f":"CONCATENATE(\"Ontvangen en geaccepteerde declaraties m.b.t. \",jaar_id-1)","v":"Ontvangen en geaccepteerde declaraties m.b.t. 2023"},{"$f":"CONCATENATE(\"Ontvangen en geaccepteerde declaraties m.b.t. \",jaar_id-2)","v":"Ontvangen en geaccepteerde declaraties m.b.t. 2022"},"In 2024 ontvangen en geaccepteerde declaraties m.b.t. 2021 en ouder"]
[null,null,null,null,null,null,null,null,null,"Ontvangen en geaccepteerde declaraties mbt jaar T",null,"Ontvangen en geaccepteerde declaraties mbt jaar T","Ontvangen en geaccepteerde declaraties mbt jaar T","Ontvangen en geaccepteerde declaraties mbt jaar T-1"]
[null,null,null," 01  HUISARTSENZORG en MDZ"]
{"$rows_left_out":133}
{"sheet":"Specifieke informatie A","index":5,"n_rows":64,"n_cols":13,"rows_kept":64,"cut":false,"hidden":false,"merged":[[52,12,53,12],[19,11,20,11],[19,12,20,12],[40,11,41,11],[40,12,41,12],[46,12,47,12],[46,11,47,11],[52,11,53,11],[29,11,30,11],[24,11,25,11],[48,3,48,9],[49,3,49,9],[50,3,50,9],[19,3,20,9],[29,3,30,9],[27,3,27,9],[40,3,41,9],[43,3,43,9],[31,3,31,9],[26,3,26,9],[42,3,42,9],[24,10,25,10],[24,12,25,12],[15,3,15,9],[16,3,16,9],[11,12,12,12],[13,3,13,9],[11,10,12,10],[11,3,12,9],[14,3,14,9],[11,11,12,11],[19,10,20,10],[21,3,21,9],[22,3,22,9],[24,3,25,9],[29,10,30,10],[29,12,30,12],[63,3,63,4],[46,3,47,9],[46,10,47,10],[33,3,33,4],[54,3,56,4],[54,5,54,9],[55,5,55,9],[56,5,56,9],[52,3,53,9],[52,10,53,10],[57,3,57,9],[60,3,60,9],[61,3,61,9],[40,10,41,10]]}
[null,null,"INVULSPECIFICATIES SPECIFIEKE INFORMATIE A"]
[]
[]
[]
[]
["Pagina 1",null,null,{"$f":"CONCATENATE(\"JAARSTAAT ZVW \", jaar_id)","v":"JAARSTAAT ZVW 2024"}]
[null,null,null,"SPECIFIEKE INFORMATIE A  2024: DETAILINFORMATIE RVE"]
[null,null,null,{"$f":"IF(naw_uzovi_zorgverzekeraar<>\"0000\",CONCATENATE(UPPER(naw_naam_zorgverzekeraar),\", \",UPPER(naw_plaats_zorgverzekeraar)),\"\")","v":""},null,null,null,null,null,null,null,null,{"$f":"CONCATENATE(\"UZOVI: \",naw_uzovi_zorgverzekeraar)","v":"UZOVI: 0000"}]
[]
[null,null,null,"SPECIFICATIES INFORMATIE RISICOVEREVENING"]
[null,null,null,"KOSTEN NAAR DEELBIJDRAGE"]
[null,null,null," KOSTEN NAAR DEELBIJDRAGE",null,null,null,null,null,null,{"$f":"CONCATENATE(\"LASTEN \",jaar_id,\" inclusief balanspost \")","v":"LASTEN 2024 inclusief balanspost "},{"$f":"CONCATENATE(\"LASTEN \",jaar_id-2,\" ontvangen en geaccepteerde declaraties \")","v":"LASTEN 2022 ontvangen en geaccepteerde declaraties "},"In 2024 ontvangen en geaccepteerde declaraties m.b.t. 2021 en ouder"]
[null,null,null,null,null,null,null,null,null,null,null,null,"Ontvangen en geaccepteerde declaraties mbt jaar T-1"]
[null,null,null," Variabele zorgkosten"]
[null,null,null," Vaste zorgkosten "]
{"$rows_left_out":50}
{"sheet":"Specifieke informatie C","index":6,"n_rows":129,"n_cols":12,"rows_kept":129,"cut":false,"hidden":false,"merged":[[70,9,71,9],[70,10,71,10],[70,11,71,11],[10,7,10,8],[10,3,12,6],[11,8,12,8],[11,9,12,9],[10,9,10,10],[114,5,114,9],[31,3,31,6],[25,7,25,8],[26,10,27,10],[42,3,42,4],[62,5,62,6],[63,3,63,6],[64,3,64,6],[76,3,76,6],[77,3,77,6],[62,7,62,11],[75,3,75,6],[65,3,65,6],[66,3,66,6],[74,3,74,6],[56,3,56,6],[11,11,12,11],[32,3,32,6],[29,3,29,6],[11,10,12,10],[11,7,12,7],[26,8,27,8],[26,11,27,11],[25,9,25,10],[13,3,13,6],[26,9,27,9],[14,3,14,6],[15,3,15,6],[26,7,27,7],[22,3,22,6],[19,11,20,11],[25,3,27,6],[18,3,20,6],[18,7,18,8],[18,9,18,10],[19,7,20,7],[19,8,20,8],[19,9,20,9],[19,10,20,10],[21,3,21,6],[35,11,36,11],[37,3,37,6],[59,9,59,10],[59,3,61,4],[59,7,59,8],[38,3,38,6],[39,3,39,6],[40,3,40,6],[41,3,41,6],[48,3,50,6],[48,7,48,8],[48,9,48,10],[49,7,50,7],[60,11,61,11],[60,9,61,9],[60,7,61,7],[34,3,36,6],[34,7,34,8],[34,9,34,10],[35,7,36,7],[35,8,36,8],[35,9,36,9],[35,10,36,10],[62,3,62,4],[60,10,61,10],[49,9,50,9],[49,10,50,10],[49,11,50,11],[51,3,51,6],[52,3,52,6],[53,3,53,6],[54,3,54,6],[55,3,55,6],[59,5,61,6],[60,8,61,8],[49,8,50,8],[116,3,116,9],[72,5,72,6],[67,3,67,6],[72,3,72,4],[93,3,94,9],[87,3,87,4],[93,10,94,10],[95,3,95,9],[101,3,101,9],[102,3,102,9],[96,3,96,9],[97,3,97,9],[72,7,72,11],[73,3,73,6],[115,5,115,9],[93,11,94,11],[98,3,98,9],[99,3,99,9],[69,3,71,4],[69,5,71,6],[69,7,69,8],[69,9,69,10],[70,7,71,7],[70,8,71,8],[30,3,30,6],[28,3,28,6],[128,3,128,4],[119,11,120,11],[121,3,122,4],[121,5,121,9],[122,5,122,9],[123,3,123,9],[124,3,124,9],[105,11,106,11],[107,3,107,9],[108,3,108,9],[109,3,109,9],[112,3,113,9],[112,10,113,10],[112,11,113,11],[114,3,115,4],[117,3,117,9],[119,3,120,9],[119,10,120,10],[100,3,100,9],[103,3,103,9],[105,3,106,9],[105,10,106,10]]}
[null,null,"INVULSPECIFICATIES SPECIFIEKE INFORMATIE C"]
[]
[]
[]
[]
["Pagina 1",null,null,{"$f":"CONCATENATE(\"JAARSTAAT ZVW \", jaar_id)","v":"JAARSTAAT ZVW 2024"}]
[null,null,null,"SPECIFIEKE INFORMATIE C: SPECIFICATIES VAN KOSTEN EN PRODUCTIE"]
[null,null,null,{"$f":"IF(naw_uzovi_zorgverzekeraar<>\"0000\",CONCATENATE(UPPER(naw_naam_zorgverzekeraar),\", \",UPPER(naw_plaats_zorgverzekeraar)),\"\")","v":""},null,null,null,null,null,null,null,{"$f":"CONCATENATE(\"UZOVI: \",naw_uzovi_zorgverzekeraar)","v":"UZOVI: 0000"}]
[null,null,null,"SPECIFICATIES VAN KOSTEN EN PRODUCTIE"]
[null,null,null,"RUBRIEK 06 MEDISCH SPECIALISTISCHE ZORG"]
[null,null,null," CODE 610 - OVERIGE KOSTEN \n ZIEKENHUISZORG EN CURATIEVE ZORG",null,null,null,{"$f":"CONCATENATE(\"LASTEN \",jaar_id)","v":"LASTEN 2024"},null,{"$f":"CONCATENATE(\"LASTEN \",jaar_id-1)","v":"LASTEN 2023"},null,{"$f":"CONCATENATE(\"LASTEN \",jaar_id-2)","v":"LASTEN 2022"}]
[null,null,null,null,null,null,null,{"$f":"CONCATENATE(\"LASTEN \",jaar_id,\" inclusief balanspost \")","v":"LASTEN 2024 inclusief balanspost "},{"$f":"CONCATENATE(\"Ontvangen en geaccepteerde declaraties m.b.t. \",jaar_id)","v":"Ontvangen en geaccepteerde declaraties m.b.t. 2024"},{"$f":"CONCATENATE(\"LASTEN \",jaar_id-1,\" inclusief balanspost \")","v":"LASTEN 2023 inclusief balanspost "},{"$f":"CONCATENATE(\"Ontvangen en geaccepteerde declaraties m.b.t. \",jaar_id-1)","v":"Ontvangen en geaccepteerde declaraties m.b.t. 2023"},{"$f":"CONCATENATE(\"Ontvangen en geaccepteerde declaraties m.b.t. \",jaar_id-2)","v":"Ontvangen en geaccepteerde declaraties m.b.t. 2022"}]
[null,null,null,null,null,null,null,null,"Ontvangen en geaccepteerde declaraties mbt jaar T-1",null,"Ontvangen en geaccepteerde declaraties mbt jaar T-1","Ontvangen en geaccepteerde declaraties mbt jaar T-1"]
[null,null,null," Kosten van eerstelijnsdiagnostiek aangevraagd \n door eerstelijns zorgaanbieders, geleverd door \n huisartsenlaboratoria"]
[null,null,null," Trombosediensten"]
{"$rows_left_out":115}
{"sheet":"Contractinformatie","index":7,"n_rows":92,"n_cols":12,"rows_kept":92,"cut":false,"hidden":false,"merged":[[91,3,91,4],[80,3,80,11],[66,11,67,11],[66,10,67,10],[71,5,71,9],[71,3,71,4],[73,10,74,10],[73,11,74,11],[75,3,75,11],[73,9,74,9],[66,9,67,9],[66,3,67,8],[73,3,74,8],[76,3,76,8],[85,3,85,11],[88,3,88,8],[51,9,52,9],[38,3,38,8],[39,3,39,8],[43,3,43,8],[41,3,41,8],[32,3,33,8],[36,3,36,8],[37,3,37,8],[45,3,45,4],[44,3,44,8],[40,3,40,8],[51,11,52,11],[23,10,24,10],[51,10,52,10],[32,11,33,11],[23,11,24,11],[32,10,33,10],[23,9,24,9],[10,11,11,11],[16,3,16,11],[12,3,12,11],[10,10,11,10],[10,9,11,9],[14,3,14,8],[15,3,15,8],[23,3,24,8],[17,3,17,8],[18,3,18,8],[19,3,19,8],[20,3,20,8],[28,3,28,8],[60,3,60,8],[72,3,72,10],[78,3,78,8],[83,3,83,8],[77,3,77,8],[79,3,79,8],[59,3,59,8],[51,3,52,8],[53,3,53,8],[54,3,54,8],[55,3,55,8],[56,3,56,8],[57,3,57,8],[58,3,58,8],[32,9,33,9]]}
[null,null,"INVULSPECIFICATIES SPECIFIEKE INFORMATIE C"]
[]
[]
[]
[]
["Pagina 1",null,null,{"$f":"CONCATENATE(\"JAARSTAAT ZVW \", jaar_id)","v":"JAARSTAAT ZVW 2024"}]
[null,null,null,"SPECIFIEKE INFORMATIE C (CONTRACTINFORMATIE)"]
[null,null,null,{"$f":"IF(naw_uzovi_zorgverzekeraar<>\"0000\",CONCATENATE(UPPER(naw_naam_zorgverzekeraar),\", \",UPPER(naw_plaats_zorgverzekeraar)),\"\")","v":""},null,null,null,null,null,null,null,{"$f":"CONCATENATE(\"UZOVI: \",naw_uzovi_zorgverzekeraar)","v":"UZOVI: 0000"}]
[]
[null,null,null,"CONTRACTINFORMATIE HUISARTSENZORG EN MULTIDISCIPLINAIRE ZORG, rubriek 01"]
[null,null,null,null,null,null,null,null,null,{"$f":"CONCATENATE(\"LASTEN \",jaar_id,\" inclusief balanspost \")","v":"LASTEN 2024 inclusief balanspost "},{"$f":"CONCATENATE(\"LASTEN \",jaar_id-1,\" inclusief balanspost \")","v":"LASTEN 2023 inclusief balanspost "},{"$f":"CONCATENATE(\"LASTEN \",jaar_id-2,\" inclusief balanspost \")","v":"LASTEN 2022 inclusief balanspost "}]
[null,null,null,null,null,null,null,null,null,"Ontvangen en geaccepteerde declaraties mbt jaar T","Ontvangen en geaccepteerde declaraties mbt jaar T","Ontvangen en geaccepteerde declaraties mbt jaar T"]
[null,null,null," Huisartsenzorg, codes 503, 504, 505, 506,507, 515"]
[null,null,null," Gecontracteerde zorg"]
[null,null,null," Niet gecontracteerde zorg"]
{"$rows_left_out":78}
{"sheet":"Controleoverzicht","index":8,"n_rows":217,"n_cols":12,"rows_kept":217,"cut":false,"hidden":false,"merged":[[202,3,202,8],[195,3,195,8],[196,3,196,8],[183,3,183,8],[184,3,184,8],[178,3,178,8],[150,3,151,8],[144,3,144,8],[158,3,158,8],[159,3,159,8],[160,3,160,8],[156,3,156,8],[157,3,157,8],[201,3,201,8],[198,3,198,8],[200,3,200,8],[199,3,199,8],[145,3,145,8],[154,3,154,8],[171,3,172,8],[173,3,173,8],[153,3,153,8],[213,3,213,8],[214,3,214,8],[205,3,206,8],[205,9,206,9],[205,10,206,10],[205,11,206,11],[207,3,207,8],[208,3,208,8],[209,3,209,8],[210,3,210,8],[211,3,211,8],[212,3,212,8],[193,10,194,10],[193,11,194,11],[197,3,197,8],[185,3,185,8],[181,3,182,8],[193,9,194,9],[186,3,186,8],[187,3,187,8],[190,3,190,8],[189,3,189,8],[193,3,194,8],[188,3,188,8],[27,11,28,11],[49,11,50,11],[27,10,28,10],[24,3,24,8],[22,11,23,11],[22,10,23,10],[22,9,23,9],[22,3,23,8],[87,3,87,9],[85,3,85,9],[69,3,69,9],[53,3,53,9],[52,3,52,9],[57,3,57,9],[60,3,60,9],[59,3,59,9],[63,3,63,9],[64,3,64,9],[65,3,65,9],[58,3,58,9],[56,3,56,9],[66,3,66,9],[67,3,67,9],[68,3,68,9],[9,11,10,11],[9,9,10,9],[13,9,14,9],[9,3,10,8],[9,10,10,10],[17,10,18,10],[17,9,18,9],[19,3,19,8],[13,3,14,8],[17,11,18,11],[13,11,14,11],[11,3,11,8],[15,3,15,8],[17,3,18,8],[13,10,14,10],[25,3,25,8],[70,3,70,9],[62,3,62,9],[37,3,37,9],[114,11,115,11],[114,9,115,9],[114,10,115,10],[114,3,115,8],[124,3,124,8],[100,10,101,10],[100,11,101,11],[118,3,118,8],[123,3,123,8],[120,3,120,8],[121,3,121,8],[122,3,122,8],[119,3,119,8],[100,9,101,9],[107,3,107,8],[104,3,104,8],[100,3,101,8],[102,3,102,8],[103,3,103,8],[116,3,116,8],[27,3,28,9],[39,3,39,9],[40,3,40,9],[32,3,32,9],[36,3,36,9],[20,3,20,8],[97,3,97,9],[73,3,73,9],[74,3,74,9],[72,3,72,9],[81,3,82,9],[90,3,90,9],[86,3,86,9],[84,3,84,9],[88,3,88,9],[89,3,89,9],[95,3,95,8],[92,3,92,9],[94,3,94,8],[83,3,83,9],[93,3,93,8],[96,3,96,8],[33,3,33,9],[29,3,29,9],[143,3,143,8],[155,3,155,8],[49,10,50,10],[30,3,30,9],[49,3,50,9],[54,3,54,9],[71,3,71,9],[61,3,61,9],[55,3,55,9],[42,3,42,9],[105,3,105,8],[81,10,82,10],[35,3,35,9],[41,3,41,9],[38,3,38,9],[51,3,51,9],[34,3,34,9],[31,3,31,9],[106,3,106,8],[81,11,82,11],[117,3,117,8],[171,11,172,11],[171,9,172,9],[171,10,172,10],[141,11,142,11],[150,11,151,11],[181,11,182,11],[181,9,182,9],[181,10,182,10],[91,3,91,9],[150,10,151,10],[152,3,152,8],[174,3,174,8],[175,3,175,8],[177,3,177,8],[176,3,176,8],[150,9,151,9],[147,3,147,8],[141,10,142,10],[148,3,148,8],[146,3,146,8],[141,3,142,8],[141,9,142,9]]}
[null,null,"SPECIFICATIES CONTROLEOVERZICHT"]
[]
[]
[]
[]
["Pagina 1",null,null,{"$f":"CONCATENATE(\"JAARSTAAT ZVW \", jaar_id)","v":"JAARSTAAT ZVW 2024"}]
[null,null,null,"CONTROLEOVERZICHT",null,null,null,null,null,null,null,{"$f":"CONCATENATE(\"UZOVI: \",naw_uzovi_zorgverzekeraar)","v":"UZOVI: 0000"}]
[null,null,null,{"$f":"IF(naw_uzovi_zorgverzekeraar<>\"0000\",CONCATENATE(UPPER(naw_naam_zorgverzekeraar),\", \",UPPER(naw_plaats_zorgverzekeraar)),\"\")","v":""}]
[null,null,null,"SPECIFIEKE INFORMATIE 2024 EN A"]
[null,null,null," SPECIFICATIES KOSTEN NAAR DEELBIJDRAGE",null,null,null,null,null,"LASTEN 2024 inclusief balanspost","Kosten naar deelbijdrage","Verschil"]
[]
[null,null,null," Totaal kosten naar deelbijdrage (totaal lasten t/m rubriek 16) - \n inclusief balanspost",null,null,null,null,null,{"$f":"Kostenverzamelstaat!I128","v":0},{"$f":"'Specifieke informatie A'!K17","v":0},{"$f":"IF(J12<>K12,J12-K12,\"\")","v":""}]
[]
[null,null,null," SPECIFICATIES KOSTEN NAAR DEELBIJDRAGE",null,null,null,null,null,"Ontvangen en \ngeaccepteerde \ndeclaraties mbt \n2022","Kosten naar deelbijdrage","Verschil"]
[]
{"$rows_left_out":203}
{"sheet":"Blad1","index":9,"n_rows":712,"n_cols":12,"rows_kept":712,"cut":false,"hidden":true,"merged":[]}
[]
[]
[]
[]
[]
[]
[]
[]
[]
[]
[]
[null,null,null,null,"vcd_spec_idvar","vcd_waarde_flt","vcd_waarde_txt","vcd_toelichting_txt","vcd_spec1_idvar","vcd_spec2_idvar","vcd_spec3_idvar","vcd_attrib_idvar"]
[null,null,null,null,"xstaat_kdrwet_id_","*=0","ZVWY","Excel numeriek om te zetten sleutel kdrwet via waarden","xstaat","kdrwet","id",""]
[null,null,null,null,"xstaat_kdrwet_idjmd_","*=0",20241231,"Excel numeriek om te zetten sleutel kdrwet periode","xstaat","kdrwet","idjmd",""]
[null,null,null,null,"xstaat_uzovi_filename_","*=0","*=@CEL(\"bestandsnaam\")","Excel numeriek filenaam bevat ook sleutels","xstaat","uzovi","filename",""]
{"$rows_left_out":698}
{"sheet":"Parameters","index":10,"n_rows":62,"n_cols":12,"rows_kept":62,"cut":false,"hidden":true,"merged":[[0,10,0,11]]}
[null,null,null,null,"Alle mogelijke modelovereenkomsten 2023 waaruit gekozen kan worden",null,null,null,null,null,"Weergave van de gekozen modelovereenkomsten (voor het doorsluizen naar Blad1)"]
["Kwartaal:",null,null,null,"nummer DWH","Naam modelovereenkomst","verzekeraar","Combi","nummer DWH",null,"Overeenkomst","Keuze"]
["Jaar:",2024,null,null,80,"De Friesland Alles Verzorgd Polis","De Friesland Zorgverzekeraar N.V.",{"$f":"E3&\"  \"&F3","v":"80  De Friesland Alles Verzorgd Polis"},80,null,1,{"$f":"IFERROR(VLOOKUP('Specifieke informatie A'!#REF!,Parameters!$H$2:$I$68,2,FALSE),\"\")","v":""}]
["Wet:","ZVW",null,null,109,"De Friesland Zelf Bewust Polis","De Friesland Zorgverzekeraar N.V.","109  De Friesland Zelf Bewust Polis",109,null,2,{"$f":"IFERROR(VLOOKUP('Specifieke informatie A'!#REF!,Parameters!$H$2:$I$68,2,FALSE),\"\")","v":""}]
["Document:",{"$f":"CONCATENATE(\"JS\",jaar_id,wet_id,\".\",kwartaal_id,revisie_id)","v":"JS2024ZVW.C"},null,null,104,"FBTO Zorgverzekering Basis Plus","FBTO Zorgverzekeringen N.V.","104  FBTO Zorgverzekering Basis Plus",104,null,3,{"$f":"IFERROR(VLOOKUP('Specifieke informatie A'!#REF!,Parameters!$H$2:$I$68,2,FALSE),\"\")","v":""}]
["Revisie:","C",null,null,105,"FBTO Zorgverzekering Basis Vrij","FBTO Zorgverzekeringen N.V.","105  FBTO Zorgverzekering Basis Vrij",105,null,4,{"$f":"IFERROR(VLOOKUP('Specifieke informatie A'!#REF!,Parameters!$H$2:$I$68,2,FALSE),\"\")","v":""}]
["Revisiedatum:","2024-11-01",null,null,130,"FBTO Zorgverzekering Basis","FBTO Zorgverzekeringen N.V.","130  FBTO Zorgverzekering Basis",130,null,5,{"$f":"IFERROR(VLOOKUP('Specifieke informatie A'!#REF!,Parameters!$H$2:$I$68,2,FALSE),\"\")","v":""}]
["Versie:",{"$f":"CONCATENATE(document_id,)","v":"JS2024ZVW.C"},null,null,27,"Interpolis ZorgActief ","Interpolis Zorgverzekeringen N.V.","27  Interpolis ZorgActief ",27,null,6,{"$f":"IFERROR(VLOOKUP('Specifieke informatie A'!#REF!,Parameters!$H$2:$I$68,2,FALSE),\"\")","v":""}]
[null,null,null,null,113,"Interpolis ZorgCompact","Interpolis Zorgverzekeringen N.V.","113  Interpolis ZorgCompact",113]
[null,null,null,null,55,"Zilveren Kruis Basis Zeker","Zilveren Kruis Zorgverzekeringen N.V.","55  Zilveren Kruis Basis Zeker",55]
[null,null,null,null,66,"Zilveren Kruis Basis Exclusief","Zilveren Kruis Zorgverzekeringen N.V.","66  Zilveren Kruis Basis Exclusief",66]
["NUMMER_UO","NAAM_UO","FORMAT_UO1",null,85,"Zilveren Kruis Basis Budget","Zilveren Kruis Zorgverzekeringen N.V.","85  Zilveren Kruis Basis Budget",85]
["0000","KIES UW UZOVI-NUMMER",{"$f":"CONCATENATE(A13,\" \",B13)","v":"0000 KIES UW UZOVI-NUMMER"},null,91,"Pro Life Principe Polis (natura)","Zilveren Kruis Zorgverzekeringen N.V.","91  Pro Life Principe Polis (natura)",91]
["0101","UNIVÉ ZORG",{"$f":"CONCATENATE(A14,\" \",B14)","v":"0101 UNIVÉ ZORG"},null,114,"Pro Life Principe Polis Budget","Zilveren Kruis Zorgverzekeringen N.V.","114  Pro Life Principe Polis Budget",114]
["0104","CENTRALE ZORGVERZEKERINGEN NZV N.V.","0104 CENTRALE ZORGVERZEKERINGEN NZV N.V.",null,108,"ZieZo Basis","Zilveren Kruis Zorgverzekeringen N.V.","108  ZieZo Basis",108]
{"$rows_left_out":47}